{"text_format":"3","workbook":"xlsx","n_sheets":5,"sheets":["Title&Introduction","StartHere","Data","Results","Calc_H"],"not_rendered":{"images":1,"macros":1,"defined_names":38,"comments":2},"read":"whole","date_system":"1900"}

{"sheet":"Title&Introduction","index":0,"n_rows":0,"n_cols":0,"rows_kept":0}

{"sheet":"StartHere","index":1,"n_rows":41,"n_cols":11,"rows_kept":41,"merged":[[34,0,35,0],[34,1,35,1],[34,2,35,2]]}
[]
[]
[]
["Local Parameters"]
["Patm",101," kPa"]
["O2",21," kPa"]
[]
["Options",{"$nulls":3},"Limiting Factor 1","Limiting Factor 2","Limiting Factor 3"]
["Group data for analysis?","Yes",null,"Limiting Criteria (Ci in Pa):",20,30,50]
[]
[]
["Choose units for  Ci:","Ci (ppm)"]
[{"$nulls":5},{"$f":"IF($B$9=\"No\",\"\",\"Assign a column letter to each considered group level (maximum: 6 group levels)!\")","v":"Assign a column letter to each considered group level (maximum: 6 group levels)!"}]
["Indicate below columns in sheet \"Data\" for required inputs variables:",{"$nulls":4},{"$f":"IF($B$9=\"No\",\"\",\" Leave blank unusued group levels!\")","v":" Leave blank unusued group levels!"}]
[null,"Aleaf","Tleaf","Ci","Observation Nos.",{"$f":"IF($B$9=\"No\",\"\",\"Group Level 1\")","v":"Group Level 1"},{"$f":"IF($B$9=\"No\",\"\",\"Group Level 2\")","v":"Group Level 2"},{"$f":"IF($B$9=\"No\",\"\",\"Group Level 3\")","v":"Group Level 3"},{"$f":"IF($B$9=\"No\",\"\",\"Group Level 4\")","v":"Group Level 4"},{"$f":"IF($B$9=\"No\",\"\",\"Group Level 5\")","v":"Group Level 5"},{"$f":"IF($B$9=\"No\",\"\",\"Group Level 6\")","v":"Group Level 6"}]
[null,"(μmol m-2 s-1 )","(ºC)","(ppm or Pa)"]
["Column (letter)","H","J","I","G","A","B","C","D","E","F"]
[]
["In  sheet \"Data\", delete data?","No",{"$f":"IF(B19=\"Yes\",\"   Attention you chose to delete data in sheet \"\"Data\"\"!\",\"\")","v":""}]
[]
[]
["Constants for Assimilation Model"]
[null,"@ 25°C","c","ΔΗa","ΔΗd","ΔS"]
[{"$nulls":3},"(kJ mol-1)","(kJ mol-1)","(kJ K-1 mol-1)"]
["Kc (Pa)",{"$f":"EXP(C25-(D25/(0.008314*(273.15+25))))","v":{"v":27.237212416150175,"d":"27.24"}},{"v":35.9774,"d":"35.98"},80.99]
["Ko (kPa)",{"$f":"EXP(C26-(D26/(0.008314*(273.15+25))))","v":{"v":16.578843123126067,"d":"16.58"}},{"v":12.3772,"d":"12.38"},23.72]
["Γ∗ (Pa) (with O = 21 kPa)",{"v":3.741168981826146,"d":"3.74"},{"v":11.187,"d":"11.19"},24.46]
["Vcmax",{"v":0.999708524844726,"d":"1.0"},{"v":26.355,"d":"26.36"},65.33]
["J",{"v":0.9999541167039518,"d":"1.0"},17.71,{"v":43.9,"d":"43.90"}]
["TPU",{"$f":"EXP(C30-(D30/(0.008314*(273.15+25))))/(1+EXP(F30*(273.15+25)-E30)/(0.008314*(273.15+25)))","v":{"v":1.0391202435086955,"d":"1.0"}},21.46,{"v":53.1,"d":"53.10"},{"v":201.8,"d":"201.80"},0.65]
["Rd",{"v":1.000443638812836,"d":"1.0"},{"v":18.715,"d":"18.72"},46.39]
["gm",{"$f":"EXP(C32-(D32/(0.008314*(273.15+25))))/(1+EXP(F32*(273.15+25)-E32)/(0.008314*(273.15+25)))","v":{"v":1.0004721866029525,"d":"1.0"}},20.01,{"v":49.6,"d":"49.60"},{"v":437.4,"d":"437.40"},{"v":1.4,"d":"1.40"}]
[]
["Estimates for Solver"]
["Parameters to fit","Estimates for Solver @ T leaf","Parameter units"]
[]
["Vcmax",{"v":150,"d":"150.0"},"μmol m-2 s-1"]
["J",{"v":180,"d":"180.0"},"μmol m-2 s-1"]
["TPU",{"v":12,"d":"12.0"},"μmol m-2 s-1"]
["Rd",{"v":3,"d":"3.0"},"μmol m-2 s-1"]
["gm",{"v":3,"d":"3.0"},"μmol m-2 s-1 Pa-1 "]

{"sheet":"Data","index":2,"n_rows":83,"n_cols":10,"rows_kept":83,"merged":[[5,1,8,13],[9,1,9,13]]}
[]
[]
[]
[]
[]
[null,"Place your data below (starting in any line after these comments), and you may create one or two title lines (column titles may not start with a number!). However, you must present the variables by columns (starting in column A) and without blank columns.  Only columns corresponding to levels and input variables will be copied to sheet \"Results\",and displayed along with the output variables. You already told the program which columns the required input variables are placed in. You are not allowed to write required input variables after column Z, but other variables, that are not used, may be placed thereafter (until column AZ).  All columns that contain members of considered group levels (if any), must be sorted in ascending order. Observations within each series (i.e., each A/Ci curve) must also be sorted in ascending order (this is only to identify each A/Ci curve). Notice that if data are ungrouped, there will be one set of output variables for each series of observations, while grouped data will yield 1 set of output variables for each inner group, thus pooling multiple series of observations."]
[]
[]
[]
[null,"After inserting data press the button \"Step 2 of 2\", above!"]
["Year","DOY","Tree","Treatment","Organ","Position","Obs","Photo","Ci","Tleaf"]
[2008,"1900-05-28",1,"Vertical","Verdasca","Interna",1,13.9,201,26.07]
[2008,"1900-05-28",1,"Vertical","Verdasca","Interna",2,8.39,131,25.84]
[2008,"1900-05-28",1,"Vertical","Verdasca","Interna",3,5.07,67.1,25.74]
[2008,"1900-05-28",1,"Vertical","Verdasca","Interna",4,1.34,55.1,25.84]
[2008,"1900-05-28",1,"Vertical","Verdasca","Interna",5,14.8,242,25.49]
[2008,"1900-05-28",1,"Vertical","Verdasca","Interna",6,22.6,413,25.18]
[2008,"1900-05-28",1,"Vertical","Verdasca","Interna",7,26,653,24.96]
[2008,"1900-05-28",1,"Vertical","Verdasca","Interna",8,{"v":26.9,"d":"2.69E+01"},1220,24.78]
[2008,"1900-05-28",1,"Vertical","Verdasca","Interna",9,{"v":28.2,"d":"2.82E+01"},1740,24.79]
[2008,"1900-05-28",3,"Máxima","Verdasca","Externa",1,16,153,22.28]
[2008,"1900-05-28",3,"Máxima","Verdasca","Externa",2,9.77,55.7,21.85]
[2008,"1900-05-28",3,"Máxima","Verdasca","Externa",3,6.33,55.7,21.87]
[2008,"1900-05-28",3,"Máxima","Verdasca","Externa",4,1.96,39,21.92]
[2008,"1900-05-28",3,"Máxima","Verdasca","Externa",5,16.2,82.4,21.98]
[2008,"1900-05-28",3,"Máxima","Verdasca","Externa",6,24.3,223,21.93]
[2008,"1900-05-28",3,"Máxima","Verdasca","Externa",7,27.1,472,21.92]
[2008,"1900-05-28",3,"Máxima","Verdasca","Externa",8,{"v":27.5,"d":"2.75E+01"},962,21.79]
[2008,"1900-05-28",3,"Máxima","Verdasca","Externa",9,{"v":28.5,"d":"2.85E+01"},1490,21.82]
[2008,"1900-05-28",3,"Máxima","Verdasca","Interna",1,18.1,222,25.76]
[2008,"1900-05-28",3,"Máxima","Verdasca","Interna",2,10.5,144,25.71]
[2008,"1900-05-28",3,"Máxima","Verdasca","Interna",3,6.69,102,25.76]
[2008,"1900-05-28",3,"Máxima","Verdasca","Interna",4,1.74,55.5,25.78]
[2008,"1900-05-28",3,"Máxima","Verdasca","Interna",5,18.3,236,25.69]
[2008,"1900-05-28",3,"Máxima","Verdasca","Interna",6,27.1,413,25.46]
[2008,"1900-05-28",3,"Máxima","Verdasca","Interna",7,29.9,686,25.12]
[2008,"1900-05-28",3,"Máxima","Verdasca","Interna",8,{"v":30.9,"d":"3.09E+01"},1250,25.22]
[2008,"1900-05-28",3,"Máxima","Verdasca","Interna",9,{"v":31,"d":"3.10E+01"},1740,25.32]
[2008,"1900-05-28",7,"Vertical","Verdasca","Externa",1,9.18,221,22.27]
[2008,"1900-05-28",7,"Vertical","Verdasca","Externa",2,5.61,135,22.18]
[2008,"1900-05-28",7,"Vertical","Verdasca","Externa",3,3.61,94.2,22.05]
[2008,"1900-05-28",7,"Vertical","Verdasca","Externa",4,1.12,51.8,21.88]
[2008,"1900-05-28",7,"Vertical","Verdasca","Externa",5,10.9,113,21.76]
[2008,"1900-05-28",7,"Vertical","Verdasca","Externa",6,17.7,294,21.78]
[2008,"1900-05-28",7,"Vertical","Verdasca","Externa",7,22,578,21.72]
[2008,"1900-05-28",7,"Vertical","Verdasca","Externa",8,{"v":25.2,"d":"2.52E+01"},1150,21.6]
[2008,"1900-05-28",7,"Vertical","Verdasca","Externa",9,{"v":26,"d":"2.60E+01"},1650,21.35]
[2008,"1900-05-28",7,"Vertical","Verdasca","Interna",1,12.2,248,20.99]
[2008,"1900-05-28",7,"Vertical","Verdasca","Interna",2,7.72,152,21.18]
[2008,"1900-05-28",7,"Vertical","Verdasca","Interna",3,4.97,106,21.25]
[2008,"1900-05-28",7,"Vertical","Verdasca","Interna",4,1.49,55.7,21.36]
[2008,"1900-05-28",7,"Vertical","Verdasca","Interna",5,13.6,244,21.58]
[2008,"1900-05-28",7,"Vertical","Verdasca","Interna",6,18.9,438,21.7]
[2008,"1900-05-28",7,"Vertical","Verdasca","Interna",7,20.6,728,21.85]
[2008,"1900-05-28",7,"Vertical","Verdasca","Interna",8,{"v":22.2,"d":"2.22E+01"},1300,22.1]
[2008,"1900-05-28",7,"Vertical","Verdasca","Interna",9,{"v":22.6,"d":"2.26E+01"},1800,22.16]
[2008,"1900-05-28",10,"Máxima","Verdasca","Externa",1,14.7,234,22.57]
[2008,"1900-05-28",10,"Máxima","Verdasca","Externa",2,9.73,142,22.69]
[2008,"1900-05-28",10,"Máxima","Verdasca","Externa",3,6.45,97,22.62]
[2008,"1900-05-28",10,"Máxima","Verdasca","Externa",4,1.9,53.8,22.49]
[2008,"1900-05-28",10,"Máxima","Verdasca","Externa",5,17.2,225,22.38]
[2008,"1900-05-28",10,"Máxima","Verdasca","Externa",6,24.5,401,22.23]
[2008,"1900-05-28",10,"Máxima","Verdasca","Externa",7,26,681,22.14]
[2008,"1900-05-28",10,"Máxima","Verdasca","Externa",8,{"v":27.3,"d":"2.73E+01"},1280,22.2]
[2008,"1900-05-28",10,"Máxima","Verdasca","Externa",9,{"v":27.6,"d":"2.76E+01"},1750,22.17]
[2008,"1900-05-28",10,"Máxima","Verdasca","Interna",1,15.6,231,22.62]
[2008,"1900-05-28",10,"Máxima","Verdasca","Interna",2,9.91,136,22.74]
[2008,"1900-05-28",10,"Máxima","Verdasca","Interna",3,6.36,94.5,22.83]
[2008,"1900-05-28",10,"Máxima","Verdasca","Interna",4,2.01,53.6,22.99]
[2008,"1900-05-28",10,"Máxima","Verdasca","Interna",5,16.7,224,23.14]
[2008,"1900-05-28",10,"Máxima","Verdasca","Interna",6,22.7,415,23.22]
[2008,"1900-05-28",10,"Máxima","Verdasca","Interna",7,24.1,700,23.39]
[2008,"1900-05-28",10,"Máxima","Verdasca","Interna",8,{"v":24.5,"d":"2.45E+01"},1280,23.42]
[2008,"1900-05-28",10,"Máxima","Verdasca","Interna",9,{"v":24.8,"d":"2.48E+01"},1780,23.41]
[2008,"1900-05-28",16,"Máxima","Verdasca","Externa",1,16.4,222,23.98]
[2008,"1900-05-28",16,"Máxima","Verdasca","Externa",2,9.69,135,24.06]
[2008,"1900-05-28",16,"Máxima","Verdasca","Externa",3,6.1,94.3,24]
[2008,"1900-05-28",16,"Máxima","Verdasca","Externa",4,1.57,56,23.94]
[2008,"1900-05-28",16,"Máxima","Verdasca","Externa",5,16.7,229,23.68]
[2008,"1900-05-28",16,"Máxima","Verdasca","Externa",6,25.3,389,23.55]
[2008,"1900-05-28",16,"Máxima","Verdasca","Externa",7,29.1,642,23.45]
[2008,"1900-05-28",16,"Máxima","Verdasca","Externa",8,{"v":30.3,"d":"3.03E+01"},1120,23.58]
[2008,"1900-05-28",16,"Máxima","Verdasca","Externa",9,{"v":30.3,"d":"3.03E+01"},1690,23.64]

{"sheet":"Results","index":3,"n_rows":83,"n_cols":214,"rows_kept":83}
[{"$nulls":52},10]
[{"$nulls":52},12]
{"$rows_empty":7}
[{"$nulls":99},"Vcmax","J","TPU","Rd","gm","Intercept","Slope","R-Squared","RMSE",{"$nulls":91},"Level 1","Level 2","Level 3","Level 4","Level 5","Level 6","Vcmax","J","TPU","Rd","gm","Intercept","Slope","R-Squared","RMSE"]
["Year","DOY","Tree","Treatment","Organ","Position","Obs","Photo","Ci","Tleaf",null,"Vcmax","J","TPU","Rd","gm","Intercept","Slope","R-Squared","RMSE",{"$nulls":79},71.46574919251948,119.98571154710449,9.43333333334056,0.09999999999999964,30,-0.7635188540407185,1.0307454794418107,0.9902137704226033,1.0457655273212352,{"$nulls":91},2008,"28/05/1900",1,"Vertical","Verdasca","Interna",71.46574919251948,119.98571154710449,9.43333333334056,0.09999999999999964,30,-0.7635188540407185,1.0307454794418107,0.9902137704226033,1.0457655273212352]
[2008,"1900-05-28",1,"Vertical","Verdasca","Interna",1,13.9,201,26.07,null,71.46574919251948,119.98571154710449,9.43333333334056,0.09999999999999964,30,-0.7635188540407185,1.0307454794418107,0.9902137704226033,1.0457655273212352,{"$nulls":79},0,0,0,0,0,0,0,0,0,{"$nulls":91},2008,"28/05/1900",3,"Máxima","Verdasca","Externa",114.11040468543791,140.8897906358476,9.36666666622961,0.10000000000000009,30,-3.334723081927663,1.1028317515620376,0.9346896369658279,3.555256793855808]
[2008,"1900-05-28",1,"Vertical","Verdasca","Interna",2,8.39,131,25.84,null,0,0,0,0,0,0,0,0,0,{"$nulls":79},0,0,0,0,0,0,0,0,0,{"$nulls":91},2008,"28/05/1900",3,"Máxima","Verdasca","Interna",87.82561302322891,143.4192237858611,10.4759590696974,0.4778772091506465,30,0.01475352751933201,0.9992378938872937,0.9992378938878069,0.28980951396266674]
[2008,"1900-05-28",1,"Vertical","Verdasca","Interna",3,5.07,67.1,25.74,null,0,0,0,0,0,0,0,0,0,{"$nulls":79},0,0,0,0,0,0,0,0,0,{"$nulls":91},2008,"28/05/1900",7,"Vertical","Verdasca","Externa",41.48351641018546,102.37571903893591,8.566666666661327,0.1,30,0.40290934534555056,0.8923871266355019,0.9415569707059908,1.965086290624619]
[2008,"1900-05-28",1,"Vertical","Verdasca","Interna",4,1.34,55.1,25.84,null,0,0,0,0,0,0,0,0,0,{"$nulls":79},0,0,0,0,0,0,0,0,0,{"$nulls":91},2008,"28/05/1900",7,"Vertical","Verdasca","Interna",43.76766632080242,97.70638073830493,7.672425623438303,0.637223914346093,14.582237026943835,0.09467276199438857,0.9884391922610039,0.9947672139944254,0.5371220672495254]
[2008,"1900-05-28",1,"Vertical","Verdasca","Interna",5,14.8,242,25.49,null,0,0,0,0,0,0,0,0,0,{"$nulls":79},0,0,0,0,0,0,0,0,0,{"$nulls":91},2008,"28/05/1900",10,"Máxima","Verdasca","Externa",59.8998305075725,123.26513921950732,9.183333333331692,0.1,30,0.02634000231325473,0.9973706246917814,0.9934336157925735,0.7421176368905673]
[2008,"1900-05-28",1,"Vertical","Verdasca","Interna",6,22.6,413,25.18,null,0,0,0,0,0,0,0,0,0,{"$nulls":79},0,0,0,0,0,0,0,0,0,{"$nulls":91},2008,"28/05/1900",10,"Máxima","Verdasca","Interna",63.04800501357551,116.83436758964159,8.188888888888272,0.10000000000000009,30,-0.1310279104296228,1.0055529839231294,0.9954701627431713,0.5505645487061602]
[2008,"1900-05-28",1,"Vertical","Verdasca","Interna",7,26,653,24.96,null,0,0,0,0,0,0,0,0,0,{"$nulls":79},0,0,0,0,0,0,0,0,0,{"$nulls":91},2008,"28/05/1900",16,"Máxima","Verdasca","Externa",72.75961995177215,137.16771935368763,10.216227208783337,0.34508685036388925,13.9937501824794,0.007571882156884868,0.9993758550966807,0.9991039424505851,0.3096167896959869]
[2008,"1900-05-28",1,"Vertical","Verdasca","Interna",8,{"v":26.9,"d":"2.69E+01"},1220,24.78,null,0,0,0,0,0,0,0,0,0,{"$nulls":79},0,0,0,0,0,0,0,0,0]
[2008,"1900-05-28",1,"Vertical","Verdasca","Interna",9,{"v":28.2,"d":"2.82E+01"},1740,24.79,null,0,0,0,0,0,0,0,0,0,{"$nulls":79},114.11040468543791,140.8897906358476,9.36666666622961,0.10000000000000009,30,-3.334723081927663,1.1028317515620376,0.9346896369658279,3.555256793855808]
[2008,"1900-05-28",3,"Máxima","Verdasca","Externa",1,16,153,22.28,null,114.11040468543791,140.8897906358476,9.36666666622961,0.10000000000000009,30,-3.334723081927663,1.1028317515620376,0.9346896369658279,3.555256793855808,{"$nulls":79},0,0,0,0,0,0,0,0,0]
[2008,"1900-05-28",3,"Máxima","Verdasca","Externa",2,9.77,55.7,21.85,null,0,0,0,0,0,0,0,0,0,{"$nulls":79},0,0,0,0,0,0,0,0,0]
[2008,"1900-05-28",3,"Máxima","Verdasca","Externa",3,6.33,55.7,21.87,null,0,0,0,0,0,0,0,0,0,{"$nulls":79},0,0,0,0,0,0,0,0,0]
[2008,"1900-05-28",3,"Máxima","Verdasca","Externa",4,1.96,39,21.92,null,0,0,0,0,0,0,0,0,0,{"$nulls":79},0,0,0,0,0,0,0,0,0]
[2008,"1900-05-28",3,"Máxima","Verdasca","Externa",5,16.2,82.4,21.98,null,0,0,0,0,0,0,0,0,0,{"$nulls":79},0,0,0,0,0,0,0,0,0]
[2008,"1900-05-28",3,"Máxima","Verdasca","Externa",6,24.3,223,21.93,null,0,0,0,0,0,0,0,0,0,{"$nulls":79},0,0,0,0,0,0,0,0,0]
[2008,"1900-05-28",3,"Máxima","Verdasca","Externa",7,27.1,472,21.92,null,0,0,0,0,0,0,0,0,0,{"$nulls":79},0,0,0,0,0,0,0,0,0]
[2008,"1900-05-28",3,"Máxima","Verdasca","Externa",8,{"v":27.5,"d":"2.75E+01"},962,21.79,null,0,0,0,0,0,0,0,0,0,{"$nulls":79},0,0,0,0,0,0,0,0,0]
[2008,"1900-05-28",3,"Máxima","Verdasca","Externa",9,{"v":28.5,"d":"2.85E+01"},1490,21.82,null,0,0,0,0,0,0,0,0,0,{"$nulls":79},87.82561302322891,143.4192237858611,10.4759590696974,0.4778772091506465,30,0.01475352751933201,0.9992378938872937,0.9992378938878069,0.28980951396266674]
[2008,"1900-05-28",3,"Máxima","Verdasca","Interna",1,18.1,222,25.76,null,87.82561302322891,143.4192237858611,10.4759590696974,0.4778772091506465,30,0.01475352751933201,0.9992378938872937,0.9992378938878069,0.28980951396266674,{"$nulls":79},0,0,0,0,0,0,0,0,0]
[2008,"1900-05-28",3,"Máxima","Verdasca","Interna",2,10.5,144,25.71,null,0,0,0,0,0,0,0,0,0,{"$nulls":79},0,0,0,0,0,0,0,0,0]
[2008,"1900-05-28",3,"Máxima","Verdasca","Interna",3,6.69,102,25.76,null,0,0,0,0,0,0,0,0,0,{"$nulls":79},0,0,0,0,0,0,0,0,0]
[2008,"1900-05-28",3,"Máxima","Verdasca","Interna",4,1.74,55.5,25.78,null,0,0,0,0,0,0,0,0,0,{"$nulls":79},0,0,0,0,0,0,0,0,0]
[2008,"1900-05-28",3,"Máxima","Verdasca","Interna",5,18.3,236,25.69,null,0,0,0,0,0,0,0,0,0,{"$nulls":79},0,0,0,0,0,0,0,0,0]
[2008,"1900-05-28",3,"Máxima","Verdasca","Interna",6,27.1,413,25.46,null,0,0,0,0,0,0,0,0,0,{"$nulls":79},0,0,0,0,0,0,0,0,0]
[2008,"1900-05-28",3,"Máxima","Verdasca","Interna",7,29.9,686,25.12,null,0,0,0,0,0,0,0,0,0,{"$nulls":79},0,0,0,0,0,0,0,0,0]
[2008,"1900-05-28",3,"Máxima","Verdasca","Interna",8,{"v":30.9,"d":"3.09E+01"},1250,25.22,null,0,0,0,0,0,0,0,0,0,{"$nulls":79},0,0,0,0,0,0,0,0,0]
[2008,"1900-05-28",3,"Máxima","Verdasca","Interna",9,{"v":31,"d":"3.10E+01"},1740,25.32,null,0,0,0,0,0,0,0,0,0,{"$nulls":79},41.48351641018546,102.37571903893591,8.566666666661327,0.1,30,0.40290934534555056,0.8923871266355019,0.9415569707059908,1.965086290624619]
[2008,"1900-05-28",7,"Vertical","Verdasca","Externa",1,9.18,221,22.27,null,41.48351641018546,102.37571903893591,8.566666666661327,0.1,30,0.40290934534555056,0.8923871266355019,0.9415569707059908,1.965086290624619,{"$nulls":79},0,0,0,0,0,0,0,0,0]
[2008,"1900-05-28",7,"Vertical","Verdasca","Externa",2,5.61,135,22.18,null,0,0,0,0,0,0,0,0,0,{"$nulls":79},0,0,0,0,0,0,0,0,0]
[2008,"1900-05-28",7,"Vertical","Verdasca","Externa",3,3.61,94.2,22.05,null,0,0,0,0,0,0,0,0,0,{"$nulls":79},0,0,0,0,0,0,0,0,0]
[2008,"1900-05-28",7,"Vertical","Verdasca","Externa",4,1.12,51.8,21.88,null,0,0,0,0,0,0,0,0,0,{"$nulls":79},0,0,0,0,0,0,0,0,0]
[2008,"1900-05-28",7,"Vertical","Verdasca","Externa",5,10.9,113,21.76,null,0,0,0,0,0,0,0,0,0,{"$nulls":79},0,0,0,0,0,0,0,0,0]
[2008,"1900-05-28",7,"Vertical","Verdasca","Externa",6,17.7,294,21.78,null,0,0,0,0,0,0,0,0,0,{"$nulls":79},0,0,0,0,0,0,0,0,0]
[2008,"1900-05-28",7,"Vertical","Verdasca","Externa",7,22,578,21.72,null,0,0,0,0,0,0,0,0,0,{"$nulls":79},0,0,0,0,0,0,0,0,0]
[2008,"1900-05-28",7,"Vertical","Verdasca","Externa",8,{"v":25.2,"d":"2.52E+01"},1150,21.6,null,0,0,0,0,0,0,0,0,0,{"$nulls":79},0,0,0,0,0,0,0,0,0]
[2008,"1900-05-28",7,"Vertical","Verdasca","Externa",9,{"v":26,"d":"2.60E+01"},1650,21.35,null,0,0,0,0,0,0,0,0,0,{"$nulls":79},43.76766632080242,97.70638073830493,7.672425623438303,0.637223914346093,14.582237026943835,0.09467276199438857,0.9884391922610039,0.9947672139944254,0.5371220672495254]
[2008,"1900-05-28",7,"Vertical","Verdasca","Interna",1,12.2,248,20.99,null,43.76766632080242,97.70638073830493,7.672425623438303,0.637223914346093,14.582237026943835,0.09467276199438857,0.9884391922610039,0.9947672139944254,0.5371220672495254,{"$nulls":79},0,0,0,0,0,0,0,0,0]
[2008,"1900-05-28",7,"Vertical","Verdasca","Interna",2,7.72,152,21.18,null,0,0,0,0,0,0,0,0,0,{"$nulls":79},0,0,0,0,0,0,0,0,0]
[2008,"1900-05-28",7,"Vertical","Verdasca","Interna",3,4.97,106,21.25,null,0,0,0,0,0,0,0,0,0,{"$nulls":79},0,0,0,0,0,0,0,0,0]
[2008,"1900-05-28",7,"Vertical","Verdasca","Interna",4,1.49,55.7,21.36,null,0,0,0,0,0,0,0,0,0,{"$nulls":79},0,0,0,0,0,0,0,0,0]
[2008,"1900-05-28",7,"Vertical","Verdasca","Interna",5,13.6,244,21.58,null,0,0,0,0,0,0,0,0,0,{"$nulls":79},0,0,0,0,0,0,0,0,0]
[2008,"1900-05-28",7,"Vertical","Verdasca","Interna",6,18.9,438,21.7,null,0,0,0,0,0,0,0,0,0,{"$nulls":79},0,0,0,0,0,0,0,0,0]
[2008,"1900-05-28",7,"Vertical","Verdasca","Interna",7,20.6,728,21.85,null,0,0,0,0,0,0,0,0,0,{"$nulls":79},0,0,0,0,0,0,0,0,0]
[2008,"1900-05-28",7,"Vertical","Verdasca","Interna",8,{"v":22.2,"d":"2.22E+01"},1300,22.1,null,0,0,0,0,0,0,0,0,0,{"$nulls":79},0,0,0,0,0,0,0,0,0]
[2008,"1900-05-28",7,"Vertical","Verdasca","Interna",9,{"v":22.6,"d":"2.26E+01"},1800,22.16,null,0,0,0,0,0,0,0,0,0,{"$nulls":79},59.8998305075725,123.26513921950732,9.183333333331692,0.1,30,0.02634000231325473,0.9973706246917814,0.9934336157925735,0.7421176368905673]
[2008,"1900-05-28",10,"Máxima","Verdasca","Externa",1,14.7,234,22.57,null,59.8998305075725,123.26513921950732,9.183333333331692,0.1,30,0.02634000231325473,0.9973706246917814,0.9934336157925735,0.7421176368905673,{"$nulls":79},0,0,0,0,0,0,0,0,0]
[2008,"1900-05-28",10,"Máxima","Verdasca","Externa",2,9.73,142,22.69,null,0,0,0,0,0,0,0,0,0,{"$nulls":79},0,0,0,0,0,0,0,0,0]
[2008,"1900-05-28",10,"Máxima","Verdasca","Externa",3,6.45,97,22.62,null,0,0,0,0,0,0,0,0,0,{"$nulls":79},0,0,0,0,0,0,0,0,0]
[2008,"1900-05-28",10,"Máxima","Verdasca","Externa",4,1.9,53.8,22.49,null,0,0,0,0,0,0,0,0,0,{"$nulls":79},0,0,0,0,0,0,0,0,0]
[2008,"1900-05-28",10,"Máxima","Verdasca","Externa",5,17.2,225,22.38,null,0,0,0,0,0,0,0,0,0,{"$nulls":79},0,0,0,0,0,0,0,0,0]
[2008,"1900-05-28",10,"Máxima","Verdasca","Externa",6,24.5,401,22.23,null,0,0,0,0,0,0,0,0,0,{"$nulls":79},0,0,0,0,0,0,0,0,0]
[2008,"1900-05-28",10,"Máxima","Verdasca","Externa",7,26,681,22.14,null,0,0,0,0,0,0,0,0,0,{"$nulls":79},0,0,0,0,0,0,0,0,0]
[2008,"1900-05-28",10,"Máxima","Verdasca","Externa",8,{"v":27.3,"d":"2.73E+01"},1280,22.2,null,0,0,0,0,0,0,0,0,0,{"$nulls":79},0,0,0,0,0,0,0,0,0]
[2008,"1900-05-28",10,"Máxima","Verdasca","Externa",9,{"v":27.6,"d":"2.76E+01"},1750,22.17,null,0,0,0,0,0,0,0,0,0,{"$nulls":79},63.04800501357551,116.83436758964159,8.188888888888272,0.10000000000000009,30,-0.1310279104296228,1.0055529839231294,0.9954701627431713,0.5505645487061602]
[2008,"1900-05-28",10,"Máxima","Verdasca","Interna",1,15.6,231,22.62,null,63.04800501357551,116.83436758964159,8.188888888888272,0.10000000000000009,30,-0.1310279104296228,1.0055529839231294,0.9954701627431713,0.5505645487061602,{"$nulls":79},0,0,0,0,0,0,0,0,0]
[2008,"1900-05-28",10,"Máxima","Verdasca","Interna",2,9.91,136,22.74,null,0,0,0,0,0,0,0,0,0,{"$nulls":79},0,0,0,0,0,0,0,0,0]
[2008,"1900-05-28",10,"Máxima","Verdasca","Interna",3,6.36,94.5,22.83,null,0,0,0,0,0,0,0,0,0,{"$nulls":79},0,0,0,0,0,0,0,0,0]
[2008,"1900-05-28",10,"Máxima","Verdasca","Interna",4,2.01,53.6,22.99,null,0,0,0,0,0,0,0,0,0,{"$nulls":79},0,0,0,0,0,0,0,0,0]
[2008,"1900-05-28",10,"Máxima","Verdasca","Interna",5,16.7,224,23.14,null,0,0,0,0,0,0,0,0,0,{"$nulls":79},0,0,0,0,0,0,0,0,0]
[2008,"1900-05-28",10,"Máxima","Verdasca","Interna",6,22.7,415,23.22,null,0,0,0,0,0,0,0,0,0,{"$nulls":79},0,0,0,0,0,0,0,0,0]
[2008,"1900-05-28",10,"Máxima","Verdasca","Interna",7,24.1,700,23.39,null,0,0,0,0,0,0,0,0,0,{"$nulls":79},0,0,0,0,0,0,0,0,0]
[2008,"1900-05-28",10,"Máxima","Verdasca","Interna",8,{"v":24.5,"d":"2.45E+01"},1280,23.42,null,0,0,0,0,0,0,0,0,0,{"$nulls":79},0,0,0,0,0,0,0,0,0]
[2008,"1900-05-28",10,"Máxima","Verdasca","Interna",9,{"v":24.8,"d":"2.48E+01"},1780,23.41,null,0,0,0,0,0,0,0,0,0,{"$nulls":79},72.75961995177215,137.16771935368763,10.216227208783337,0.34508685036388925,13.9937501824794,0.007571882156884868,0.9993758550966807,0.9991039424505851,0.3096167896959869]
[2008,"1900-05-28",16,"Máxima","Verdasca","Externa",1,16.4,222,23.98,null,72.75961995177215,137.16771935368763,10.216227208783337,0.34508685036388925,13.9937501824794,0.007571882156884868,0.9993758550966807,0.9991039424505851,0.3096167896959869,{"$nulls":79},0,0,0,0,0,0,0,0,0]
[2008,"1900-05-28",16,"Máxima","Verdasca","Externa",2,9.69,135,24.06,null,0,0,0,0,0,0,0,0,0,{"$nulls":79},0,0,0,0,0,0,0,0,0]
[2008,"1900-05-28",16,"Máxima","Verdasca","Externa",3,6.1,94.3,24,null,0,0,0,0,0,0,0,0,0,{"$nulls":79},0,0,0,0,0,0,0,0,0]
[2008,"1900-05-28",16,"Máxima","Verdasca","Externa",4,1.57,56,23.94,null,0,0,0,0,0,0,0,0,0,{"$nulls":79},0,0,0,0,0,0,0,0,0]
[2008,"1900-05-28",16,"Máxima","Verdasca","Externa",5,16.7,229,23.68,null,0,0,0,0,0,0,0,0,0,{"$nulls":79},0,0,0,0,0,0,0,0,0]
[2008,"1900-05-28",16,"Máxima","Verdasca","Externa",6,25.3,389,23.55,null,0,0,0,0,0,0,0,0,0,{"$nulls":79},0,0,0,0,0,0,0,0,0]
[2008,"1900-05-28",16,"Máxima","Verdasca","Externa",7,29.1,642,23.45,null,0,0,0,0,0,0,0,0,0,{"$nulls":79},0,0,0,0,0,0,0,0,0]
[2008,"1900-05-28",16,"Máxima","Verdasca","Externa",8,{"v":30.3,"d":"3.03E+01"},1120,23.58,null,0,0,0,0,0,0,0,0,0,{"$nulls":79},0,0,0,0,0,0,0,0,0]
[2008,"1900-05-28",16,"Máxima","Verdasca","Externa",9,{"v":30.3,"d":"3.03E+01"},1690,23.64,null,0,0,0,0,0,0,0,0,0]

{"sheet":"Calc_H","index":4,"n_rows":21,"n_cols":23,"rows_kept":21,"hidden":true}
[null,"Outputs",{"$nulls":3},"Não proteger esta folha!",null,null,"Use solver to minimize",{"$nulls":7},"@ 25°C","c","ΔHa (kJ mol-1)","ΔΗd (kJ mol-1)","ΔS (kJ K-1 mol-1)"]
[null,null,"@ T leaf","@ 25",null,null,"Intercept =",{"$f":"INTERCEPT(O11:O19,C11:C19)","v":-0.15370269847198514},"this sum of squares",{"$nulls":3},"R-Squared =",{"$f":"RSQ(O11:O19,C11:C19)","v":0.9971547516361858},null,"Kc (Pa)",{"$f":"EXP(R2-(S2/(0.008314*(273.15+25))))","v":{"v":27.237212416150175,"d":"27.24"}},{"v":35.9774,"d":"35.98"},80.99]
[null,"Vcmax",{"v":188.08620734993792,"d":"188"},{"$f":" C3/AVERAGE($S$11:$S$19)","v":{"v":209.91288666702505,"d":"210"}},"μmol m-2 s-1",null,"Slope =",{"$f":"SLOPE(O11:O19,C11:C19)","v":1.0037736912106854},{"$nulls":7},"Ko (kPa)",{"$f":"EXP(R3-(S3/(0.008314*(273.15+25))))","v":{"v":16.578843123126067,"d":"16.58"}},{"v":12.3772,"d":"12.38"},23.72]
[null,"J",{"v":161.38816338589666,"d":"161"},{"$f":" C4/AVERAGE($T$11:$T$19)","v":{"v":173.7262615436783,"d":"174"}},"μmol m-2 s-1",{"$nulls":4},{"$f":"SUM(K10:M10)","v":{"v":2.9658732350096066,"d":"2.966"}},{"$nulls":5},"Γ∗ (Pa) (with O = 21 kPa)",{"v":3.741168981826146,"d":"3.74"},{"v":11.187,"d":"11.19"},24.46]
[null,"TPU",{"v":10.361434033817666,"d":"10.4"},{"$f":" C5/AVERAGE($U$11:$U$19)","v":{"v":10.89901907615944,"d":"10.9"}},"μmol m-2 s-1",{"$nulls":10},"Vcmax",{"v":0.999708524844726,"d":"1.0"},{"v":26.355,"d":"26.36"},65.33]
[null,"Rd*",{"v":1.1843020972614653,"d":"1.18"},{"$f":" C6/AVERAGE($V$11:$V$19)","v":{"v":1.2795436403840064,"d":"1.28"}},"μmol m-2 s-1",{"$nulls":10},"J",{"v":0.9999541167039518,"d":"1.0"},17.71,{"v":43.9,"d":"43.90"}]
[null,"gm*",{"v":1.5768882618061402,"d":"1.58"},{"$f":" C7/AVERAGE($W$11:$W$19)","v":{"v":1.7128365315147913,"d":"1.71"}},"μmol m-2 s-1 Pa-1 ",{"$nulls":10},"TPU",{"$f":"EXP(R7-(S7/(0.008314*(273.15+25))))/(1+EXP(U7*(273.15+25)-T7)/(0.008314*(273.15+25)))","v":{"v":1.0391202435086955,"d":"1.0"}},21.46,{"v":53.1,"d":"53.10"},{"v":201.8,"d":"201.80"},0.65]
[{"$nulls":6},"Make no changes here",{"$nulls":8},"Rd",{"v":1.000443638812836,"d":"1.0"},{"v":18.715,"d":"18.72"},46.39]
[null,"Estimate","Enter A","Ci ","Tleaf",null,"Calculated",null,"Limitations",null,null,"Error terms",null,"J","Minimum","gm",{"$f":"EXP(R9-(S9/(0.008314*(273.15+25))))/(1+EXP(U9*(273.15+25)-T9)/(0.008314*(273.15+25)))","v":{"v":1.0004721866029525,"d":"1.0"}},20.01,{"v":49.6,"d":"49.60"},{"v":437.4,"d":"437.40"},{"v":1.4,"d":"1.40"}]
[null,"Limiting","μmol m-2 s-1 ","Pa","ºC",null,"Cc","Ac","Aj","At",{"$f":"SUM(K$11:K$19)","v":{"v":1.6729766487994828,"d":"1.67"}},{"v":0.33289658621012536,"d":"0.33"},{"v":0.9599999999999989,"d":"0.96"},"μmol m-2 s-1 ","μmol m-2 s-1 ","Kc (Pa)","Ko (kPa)","Γ∗ (Pa) (with O = 21 kPa)","Vcmax","J","TPU","Rd","gm"]
[null,1,{"v":1.57,"d":"1.6"},{"v":5.656,"d":"5.7"},{"v":23.94,"d":"24"},null,{"$f":"$D11-$C11/$C$7","v":{"v":4.660368262465376,"d":"4.66"}},{"$f":"$C$3*(($G11)-$R11)/(($G11)+$P11*(1+O2_/$Q11))-$C$6","v":{"v":2.066521240171167,"d":"2.07"}},{"$f":"$C$4*((($G11)-$R11)/(4*($G11)+8*$R11))-$C$6","v":{"v":2.3758915114903814,"d":"2.38"}},{"$f":"3*$C$5-$C$6","v":{"v":29.900000004191533,"d":"29.90"}},{"$f":"IF($B11=1,($H11-$C11)^2,\"\")","v":{"v":0.24653334194111343,"d":"0.25"}},{"$f":"IF($B11=2,($I11-$C11)^2,\"\")","v":""},{"$f":"IF($B11=3,($J11-$C11)^2,\"\")","v":""},{"$f":"($C11+$C$6)*(4*$G11+8*$R11)/($G11-$R11)","v":{"v":124.85606282597388,"d":"124.9"}},{"$f":"MIN($H11:$J11)","v":{"v":2.066521240171167,"d":"2.07"}},{"$f":"EXP($R$2-($S$2/(0.008314*(273.15+$E11))))","v":{"v":24.240127416553424,"d":"24.24"}},{"$f":"EXP($R$3-($S$3/(0.008314*(273.15+$E11))))","v":{"v":16.022363612547082,"d":"16.02"}},{"$f":"EXP($R$4-($S$4/(0.008314*(273.15+$E11))))","v":{"v":3.6117451973966537,"d":"3.61"}},{"$f":"EXP($R$5-($S$5/(0.008314*(273.15+$E11))))","v":{"v":0.9099863504975811,"d":"0.91"}},{"$f":"EXP($R$6-($S$6/(0.008314*(273.15+$E11))))","v":{"v":0.9387234979524305,"d":"0.94"}},{"$f":"EXP($R$7-($S$7/(0.008314*(273.15+$E11))))/(1+EXP($U$7*(273.15+$E11)-$T$7)/(0.008314*(273.15+$E11)))","v":{"v":0.9627232989979618,"d":"0.96"}},{"$f":"EXP($R$8-($S$8/(0.008314*(273.15+$E11))))","v":{"v":0.9358230040946944,"d":"0.94"}},{"$f":"EXP($R$9-($S$9/(0.008314*(273.15+$E11))))/(1+EXP($U$9*(273.15+$E11)-$T$9)/(0.008314*(273.15+$E11)))","v":{"v":0.931535697791053,"d":"0.93"}}]
[null,1,6.1,{"v":9.5243,"d":"9.5"},24,null,{"v":5.6559219114896795,"d":"5.66"},{"v":4.997382026379976,"d":"5.00"},{"v":5.189641833213049,"d":"5.19"},{"v":29.900000004191533,"d":"29.90"},{"v":1.2157663957499263,"d":"1.22"},"","",{"v":184.4384183243897,"d":"184.4"},{"v":4.997382026379976,"d":"5.00"},{"v":24.401148311276387,"d":"24.40"},{"v":16.05346214251874,"d":"16.05"},{"v":3.618974314989532,"d":"3.62"},{"v":0.9148592248252775,"d":"0.91"},{"v":0.9420983845886823,"d":"0.94"},{"v":0.9669087911809569,"d":"0.97"},{"v":0.9393786564892367,"d":"0.94"},{"v":0.9353204670200348,"d":"0.94"}]
[null,1,{"v":9.69,"d":"9.7"},{"v":13.635,"d":"13.6"},{"v":24.06,"d":"24"},null,{"v":7.489986282349998,"d":"7.49"},{"v":10.148995545848152,"d":"10.15"},{"v":9.390066197016848,"d":"9.39"},{"v":29.900000004191533,"d":"29.90"},{"v":0.21067691110844325,"d":"0.21"},"","",{"v":165.96581419715034,"d":"166.0"},{"v":9.390066197016848,"d":"9.39"},{"v":24.563173164499688,"d":"24.56"},{"v":16.084608440281677,"d":"16.08"},{"v":3.626214974523048,"d":"3.63"},{"v":0.9197562095788798,"d":"0.92"},{"v":0.9454840345936184,"d":"0.95"},{"v":0.971110674656954,"d":"0.97"},{"v":0.9429463747581959,"d":"0.94"},{"v":0.9391190760806531,"d":"0.94"}]
[null,2,16.4,{"v":22.422,"d":"22.4"},{"v":23.98,"d":"24"},null,{"v":12.021770384988645,"d":"12.02"},{"v":21.982779683839443,"d":"21.98"},{"v":16.428112644794197,"d":"16.43"},{"v":29.900000004191533,"d":"29.90"},"",{"v":7.9032079732478254E-4,"d":"0.00"},"",{"v":161.13055827168017,"d":"161.1"},{"v":16.428112644794197,"d":"16.43"},{"v":24.347363416115147,"d":"24.35"},{"v":16.043090660871634,"d":"16.04"},{"v":3.6165633273373388,"d":"3.62"},{"v":0.9132322598207929,"d":"0.91"},{"v":0.9409722279106735,"d":"0.94"},{"v":0.9655118084596696,"d":"0.97"},{"v":0.938192100134882,"d":"0.94"},{"v":0.9340573417208042,"d":"0.93"}]
[null,2,16.7,{"v":23.129,"d":"23.1"},{"v":23.68,"d":"24"},null,{"v":12.538522282275023,"d":"12.54"},{"v":23.879084846294106,"d":"23.88"},{"v":17.16262398203762,"d":"17.16"},{"v":29.900000004191533,"d":"29.90"},"",{"v":0.21402094875634406,"d":"0.21"},"",{"v":157.31870594781591,"d":"157.3"},{"v":17.16262398203762,"d":"17.16"},{"v":23.553830496922153,"d":"23.55"},{"v":15.888154044164954,"d":"15.89"},{"v":3.5805520738534375,"d":"3.58"},{"v":0.8891465296779018,"d":"0.89"},{"v":0.9242226447836743,"d":"0.92"},{"v":0.9447742935795324,"d":"0.94"},{"v":0.9205537366232581,"d":"0.92"},{"v":0.9152938736288831,"d":"0.92"}]
[null,2,25.3,{"v":39.289,"d":"39.3"},{"v":23.55,"d":"24"},null,{"v":23.244743337817848,"d":"23.24"},{"v":46.71309319911474,"d":"46.71"},{"v":24.956364558497736,"d":"24.96"},{"v":29.900000004191533,"d":"29.90"},"",{"v":0.11808531665645651,"d":"0.12"},"",{"v":163.5097119106025,"d":"163.5"},{"v":24.956364558497736,"d":"24.96"},{"v":23.21756505082937,"d":"23.22"},{"v":15.821383955121773,"d":"15.82"},{"v":3.5650363598190764,"d":"3.57"},{"v":0.8788928975335791,"d":"0.88"},{"v":0.9170470529714548,"d":"0.92"},{"v":0.9359135037501691,"d":"0.94"},{"v":0.9130029143484675,"d":"0.91"},{"v":0.9072689782173126,"d":"0.91"}]
[null,3,29.1,{"v":64.842,"d":"64.8"},{"v":23.45,"d":"23"},null,{"v":46.38793403677863,"d":"46.39"},{"v":79.44113575105855,"d":"79.44"},{"v":31.123068917326073,"d":"31.12"},{"v":29.900000004191533,"d":"29.90"},"","",{"v":0.6400000067064502,"d":"0.64"},{"v":151.28212978684812,"d":"151.3"},{"v":29.900000004191533,"d":"29.90"},{"v":22.96197270915892,"d":"22.96"},{"v":15.770173735811289,"d":"15.77"},{"v":3.5531377575862204,"d":"3.55"},{"v":0.8710799953811014,"d":"0.87"},{"v":0.911561061211077,"d":"0.91"},{"v":0.9291486389058986,"d":"0.93"},{"v":0.9072323043785722,"d":"0.91"},{"v":0.9011391577392496,"d":"0.90"}]
[null,3,30.3,{"v":113.12,"d":"113.1"},{"v":23.58,"d":"24"},null,{"v":93.90494162592415,"d":"93.90"},{"v":113.55071597318178,"d":"113.55"},{"v":34.88780248829986,"d":"34.89"},{"v":29.900000004191533,"d":"29.90"},"","",{"v":0.15999999664677433,"d":"0.16"},{"v":140.86213569578152,"d":"140.9"},{"v":29.900000004191533,"d":"29.90"},{"v":23.294762207786732,"d":"23.29"},{"v":15.836772675556341,"d":"15.84"},{"v":3.5686121362574403,"d":"3.57"},{"v":0.8812493702013349,"d":"0.88"},{"v":0.9186985550967531,"d":"0.92"},{"v":0.9379516167546024,"d":"0.94"},{"v":0.9147404819137409,"d":"0.91"},{"v":0.9091152323477109,"d":"0.91"}]
[null,3,30.3,{"v":170.69,"d":"170.7"},{"v":23.64,"d":"24"},null,{"v":151.47494162592415,"d":"151.47"},{"v":133.88000045218968,"d":"133.88"},{"v":36.43421906171961,"d":"36.43"},{"v":29.900000004191533,"d":"29.90"},"","",{"v":0.15999999664677433,"d":"0.16"},{"v":135.07159596970692,"d":"135.1"},{"v":29.900000004191533,"d":"29.90"},{"v":23.449880194999455,"d":"23.45"},{"v":15.867585678846202,"d":"15.87"},{"v":3.5757722782661485,"d":"3.58"},{"v":0.8859798481069078,"d":"0.89"},{"v":0.9220094810977869,"d":"0.92"},{"v":0.9420398663434119,"d":"0.94"},{"v":0.9182244849765745,"d":"0.92"},{"v":0.9128178939634334,"d":"0.91"}]
[{"$nulls":14},{"$f":"MIN($H20:$J20)","v":{"v":0,"d":"0.00"}}]
[{"$nulls":14},{"v":0,"d":"0.00"}]